Target
Genome polyprotein
Ligand
BDBM50286920
Substrate
Meas. Tech.
West Nile Virus NS2bNS3 Proteinase Inhibitor Dose Response Confirmation.
IC50
>50000±n/a nM
Citation
 PubChem, PC West Nile Virus NS2bNS3 Proteinase Inhibitor Dose Response Confirmation. PubChem Bioassay (2007)[AID] 
Target
Name:
Genome polyprotein
Synonyms:
POLG_WNV | polyprotein precursor
Type:
PROTEIN
Mol. Mass.:
380170.63
Organism:
West Nile virus
Description:
ChEMBL_1438217
Residue:
3430
  
Inhibitor
Name:
BDBM50286920
Synonyms:
(+-)-Trichlorfon CHEMBL167150 Methyl chlorophos Trichlorfon dimethyl (2,2,2-trichloro-1-hydroxyethyl)phosphonate
Type:
Small organic molecule
Emp. Form.:
C4H8Cl3O4P
Mol. Mass.:
257.437
SMILES:
COP(=O)(OC)C(O)C(Cl)(Cl)Cl
: