Target
Genome polyprotein
Ligand
BDBM39388
Substrate
Meas. Tech.
West Nile Virus NS2bNS3 Proteinase Inhibitor Dose Response Confirmation.
IC50
>50000±n/a nM
Citation
 PubChem, PC West Nile Virus NS2bNS3 Proteinase Inhibitor Dose Response Confirmation. PubChem Bioassay (2007)[AID] 
Target
Name:
Genome polyprotein
Synonyms:
POLG_WNV | polyprotein precursor
Type:
PROTEIN
Mol. Mass.:
380170.63
Organism:
West Nile virus
Description:
ChEMBL_1438217
Residue:
3430
  
Inhibitor
Name:
BDBM39388
Synonyms:
3-[2-[2-(3,5-dimethyl-1-pyrazolyl)ethyl]-4-thiazolyl]-8-methoxy-1-benzopyran-2-one 3-[2-[2-(3,5-dimethylpyrazol-1-yl)ethyl]-1,3-thiazol-4-yl]-8-methoxychromen-2-one MLS000054202 cid_2370267
Type:
Small organic molecule
Emp. Form.:
C20H19N3O3S
Mol. Mass.:
381.448
SMILES:
COc1cccc2cc(-c3csc(CCn4nc(C)cc4C)n3)c(=O)oc12
: