Target
M-phase inducer phosphatase 2
Ligand
BDBM38797
Substrate
Meas. Tech.
Cdc25B Catalytic Domain Protein Tyrosine Phosphatase Probe Assessment Dose Response assay in the presence of Catalase.
IC50
7109±n/a nM
Citation
 PubChem, PC Cdc25B Catalytic Domain Protein Tyrosine Phosphatase Probe Assessment Dose Response assay in the presence of Catalase. PubChem Bioassay (2007)[AID] 
Target
Name:
M-phase inducer phosphatase 2
Synonyms:
CDC25B Dual specificity phosphatase (CDC25B) M-phase inducer phosphatase 2 (CDC25B) | MPIP2_HUMAN
Type:
Protein
Mol. Mass.:
64985.27
Organism:
Homo sapiens (Human)
Description:
Residue:
580
  
Inhibitor
Name:
BDBM38797
Synonyms:
7-methoxy-3-methyl-1H-indole-2-carboxylic acid SMR000013451 | cid_649614
Type:
Small organic molecule
Emp. Form.:
C11H11NO3
Mol. Mass.:
205.2099
SMILES:
COc1cccc2c(C)c([nH]c12)C(O)=O
: