Target
M-phase inducer phosphatase 2
Ligand
BDBM34182
Substrate
Meas. Tech.
Cdc25B Catalytic Domain Protein Tyrosine Phosphatase Probe Assessment Dose Response assay in the presence of Catalase.
IC50
45752±n/a nM
Citation
 PubChem, PC Cdc25B Catalytic Domain Protein Tyrosine Phosphatase Probe Assessment Dose Response assay in the presence of Catalase. PubChem Bioassay (2007)[AID] 
Target
Name:
M-phase inducer phosphatase 2
Synonyms:
CDC25B Dual specificity phosphatase (CDC25B) M-phase inducer phosphatase 2 (CDC25B) | MPIP2_HUMAN
Type:
Protein
Mol. Mass.:
64985.27
Organism:
Homo sapiens (Human)
Description:
Residue:
580
  
Inhibitor
Name:
BDBM34182
Synonyms:
3-anilino-2H-isoquinolin-1-one 3-anilinoisoquinolin-1(2H)-one MLS000043701 cid_2142225
Type:
Small organic molecule
Emp. Form.:
C15H12N2O
Mol. Mass.:
236.2686
SMILES:
O=c1[nH]c(Nc2ccccc2)cc2ccccc12
: