Target
Dual specificity protein phosphatase 1
Ligand
BDBM22851
Substrate
Meas. Tech.
Cdc25B Catalytic Domain Protein Tyrosine Phosphatase Probe Assessment: MKP-1 Dose Response Selectivity comparison.
IC50
>50000±n/a nM
Citation
 PubChem, PC Cdc25B Catalytic Domain Protein Tyrosine Phosphatase Probe Assessment: MKP-1 Dose Response Selectivity comparison. PubChem Bioassay (2007)[AID] 
Target
Name:
Dual specificity protein phosphatase 1
Synonyms:
CL100 DUSP1 MAP kinase phosphatase 1 MKP1 Protein-tyrosine phosphatase CL100 | VH1
Type:
Protein phosphatase
Mol. Mass.:
39301.48
Organism:
Homo sapiens (Human)
Description:
gi_4758204
Residue:
367
  
Inhibitor
Name:
BDBM22851
Synonyms:
1,2-Dione-Based Compound, 8 1,2-naphthoquinone cid_10667
Type:
Small organic molecule
Emp. Form.:
C10H6O2
Mol. Mass.:
158.1534
SMILES:
O=C1C=Cc2ccccc2C1=O
: