Target
Isoform 2 of Nuclear receptor ROR-alpha (Alpha-2)
Ligand
BDBM39454
Substrate
Meas. Tech.
Counterscreen for activators of the nuclear receptor Steroidogenic Factor 1 (SF-1): A cell-based dose-response assay for inhibition of the RAR-related orphan receptor A (RORA)
EC50
6789±n/a nM
Citation
 PubChem, PC Counterscreen for activators of the nuclear receptor Steroidogenic Factor 1 (SF-1): A cell-based dose-response assay for inhibition of the RAR-related orphan receptor A (RORA) PubChem Bioassay (2007)[AID] 
Target
Name:
Isoform 2 of Nuclear receptor ROR-alpha (Alpha-2)
Synonyms:
NR1F1 Nuclear receptor ROR-alpha (Alpha-2) RORA RZRA
Type:
PROTEIN
Mol. Mass.:
63033.59
Organism:
Homo sapiens (Human)
Description:
EBI_101591
Residue:
556
  
Inhibitor
Name:
BDBM39454
Synonyms:
2-[(4-amino-5-pyridin-3-yl-1,2,4-triazol-3-yl)sulfanyl]-N-(2,4-difluorophenyl)acetamide 2-[[4-amino-5-(3-pyridinyl)-1,2,4-triazol-3-yl]thio]-N-(2,4-difluorophenyl)acetamide MLS000041375 cid_663413
Type:
Small organic molecule
Emp. Form.:
C15H12F2N6OS
Mol. Mass.:
362.357
SMILES:
Nn1c(SCC(=O)Nc2ccc(F)cc2F)nnc1-c1cccnc1
: