Target
Isoform 2 of Nuclear receptor ROR-alpha (Alpha-2)
Ligand
BDBM39458
Substrate
Meas. Tech.
Counterscreen for activators of the nuclear receptor Steroidogenic Factor 1 (SF-1): A cell-based dose-response assay for inhibition of the RAR-related orphan receptor A (RORA)
EC50
3687±n/a nM
Citation
 PubChem, PC Counterscreen for activators of the nuclear receptor Steroidogenic Factor 1 (SF-1): A cell-based dose-response assay for inhibition of the RAR-related orphan receptor A (RORA) PubChem Bioassay (2007)[AID] 
Target
Name:
Isoform 2 of Nuclear receptor ROR-alpha (Alpha-2)
Synonyms:
NR1F1 Nuclear receptor ROR-alpha (Alpha-2) RORA RZRA
Type:
PROTEIN
Mol. Mass.:
63033.59
Organism:
Homo sapiens (Human)
Description:
EBI_101591
Residue:
556
  
Inhibitor
Name:
BDBM39458
Synonyms:
3-[[5-[(4-chloranylphenoxy)methyl]-4-(furan-2-ylmethyl)-1,2,4-triazol-3-yl]sulfanylmethyl]-1,2,3-benzotriazin-4-one 3-[[[5-[(4-chlorophenoxy)methyl]-4-(2-furanylmethyl)-1,2,4-triazol-3-yl]thio]methyl]-1,2,3-benzotriazin-4-one MLS000053544 cid_2108763
Type:
Small organic molecule
Emp. Form.:
C22H17ClN6O3S
Mol. Mass.:
480.927
SMILES:
Clc1ccc(OCc2nnc(SCn3nnc4ccccc4c3=O)n2Cc2ccco2)cc1
: