Target
Isoform 2 of Nuclear receptor ROR-alpha (Alpha-2)
Ligand
BDBM39469
Substrate
Meas. Tech.
Counterscreen for activators of the nuclear receptor Steroidogenic Factor 1 (SF-1): A cell-based dose-response assay for inhibition of the RAR-related orphan receptor A (RORA)
EC50
>1222±n/a nM
Citation
 PubChem, PC Counterscreen for activators of the nuclear receptor Steroidogenic Factor 1 (SF-1): A cell-based dose-response assay for inhibition of the RAR-related orphan receptor A (RORA) PubChem Bioassay (2007)[AID] 
Target
Name:
Isoform 2 of Nuclear receptor ROR-alpha (Alpha-2)
Synonyms:
NR1F1 Nuclear receptor ROR-alpha (Alpha-2) RORA RZRA
Type:
PROTEIN
Mol. Mass.:
63033.59
Organism:
Homo sapiens (Human)
Description:
EBI_101591
Residue:
556
  
Inhibitor
Name:
BDBM39469
Synonyms:
5-phenyl-2-([1,2,4]triazolo[4,3-a]pyridin-3-ylsulfanylmethyl)-1,3-oxazole MLS000098668 cid_2572574
Type:
Small organic molecule
Emp. Form.:
C16H12N4OS
Mol. Mass.:
308.358
SMILES:
C(Sc1nnc2ccccn12)c1ncc(o1)-c1ccccc1
: