Target
Isoform 2 of Nuclear receptor ROR-alpha (Alpha-2)
Ligand
BDBM39494
Substrate
Meas. Tech.
Counterscreen for activators of the nuclear receptor Steroidogenic Factor 1 (SF-1): A cell-based dose-response assay for inhibition of the RAR-related orphan receptor A (RORA)
EC50
2457±n/a nM
Citation
 PubChem, PC Counterscreen for activators of the nuclear receptor Steroidogenic Factor 1 (SF-1): A cell-based dose-response assay for inhibition of the RAR-related orphan receptor A (RORA) PubChem Bioassay (2007)[AID] 
Target
Name:
Isoform 2 of Nuclear receptor ROR-alpha (Alpha-2)
Synonyms:
NR1F1 Nuclear receptor ROR-alpha (Alpha-2) RORA RZRA
Type:
PROTEIN
Mol. Mass.:
63033.59
Organism:
Homo sapiens (Human)
Description:
EBI_101591
Residue:
556
  
Inhibitor
Name:
BDBM39494
Synonyms:
MLS000049572 N-[4-[5-(3,4-dimethoxyphenyl)-1,2,4-oxadiazol-3-yl]phenyl]-3-(4-methoxyphenyl)propionamide SMR000076106 | cid_2202529
Type:
Small organic molecule
Emp. Form.:
C26H25N3O5
Mol. Mass.:
459.4938
SMILES:
COc1ccc(CCC(=O)Nc2ccc(cc2)-c2noc(n2)-c2ccc(OC)c(OC)c2)cc1
: