Target
M-phase inducer phosphatase 2
Ligand
BDBM35383
Substrate
Meas. Tech.
MKP-1 Dual Specificity Protein Tyrosine Phosphatase Probe Assessment: Cdc25B Dose Response Selectivity Assay
IC50
>50000±n/a nM
Citation
 PubChem, PC MKP-1 Dual Specificity Protein Tyrosine Phosphatase Probe Assessment: Cdc25B Dose Response Selectivity Assay PubChem Bioassay (2007)[AID] 
Target
Name:
M-phase inducer phosphatase 2
Synonyms:
CDC25B Dual specificity phosphatase (CDC25B) M-phase inducer phosphatase 2 (CDC25B) | MPIP2_HUMAN
Type:
Protein
Mol. Mass.:
64985.27
Organism:
Homo sapiens (Human)
Description:
Residue:
580
  
Inhibitor
Name:
BDBM35383
Synonyms:
MLS000091355 N-(4-methyl-5-oxo-2-[1]benzopyrano[4,3-b]pyridinyl)-4-(1-pyrrolidinylsulfonyl)benzamide N-(4-methyl-5-oxochromeno[4,3-b]pyridin-2-yl)-4-pyrrolidin-1-ylsulfonylbenzamide SMR000025916 | cid_3236129
Type:
Small organic molecule
Emp. Form.:
C24H21N3O5S
Mol. Mass.:
463.506
SMILES:
Cc1cc(NC(=O)c2ccc(cc2)S(=O)(=O)N2CCCC2)nc2c3ccccc3oc(=O)c12
: