Target
M-phase inducer phosphatase 2
Ligand
BDBM35393
Substrate
Meas. Tech.
MKP-1 Dual Specificity Protein Tyrosine Phosphatase Probe Assessment: Cdc25B Dose Response Selectivity Assay
IC50
>50000±n/a nM
Citation
 PubChem, PC MKP-1 Dual Specificity Protein Tyrosine Phosphatase Probe Assessment: Cdc25B Dose Response Selectivity Assay PubChem Bioassay (2007)[AID] 
Target
Name:
M-phase inducer phosphatase 2
Synonyms:
CDC25B Dual specificity phosphatase (CDC25B) M-phase inducer phosphatase 2 (CDC25B) | MPIP2_HUMAN
Type:
Protein
Mol. Mass.:
64985.27
Organism:
Homo sapiens (Human)
Description:
Residue:
580
  
Inhibitor
Name:
BDBM35393
Synonyms:
2-(4-ethoxyphenyl)-5-[1-[(2-methylpropan-2-yl)oxy-oxomethyl]-4-piperidinyl]-6-pyrazolo[1,5-a]pyrimidinecarboxylic acid 5-(1-tert-butoxycarbonyl-4-piperidyl)-2-p-phenetyl-pyrazolo[1,5-a]pyrimidine-6-carboxylic acid MLS000045833 cid_3240308
Type:
Small organic molecule
Emp. Form.:
C25H30N4O5
Mol. Mass.:
466.5295
SMILES:
CCOc1ccc(cc1)-c1cc2nc(C3CCN(CC3)C(=O)OC(C)(C)C)c(cn2n1)C(O)=O
: