Target
Isoform 2 of Nuclear receptor ROR-alpha (Alpha-2)
Ligand
BDBM39556
Substrate
Meas. Tech.
Dose-response cell-based assay for activators of the Retinoic Acid Receptor-related orphan receptor A (RORA)
EC50
>3667±n/a nM
Citation
 PubChem, PC Dose-response cell-based assay for activators of the Retinoic Acid Receptor-related orphan receptor A (RORA) PubChem Bioassay (2007)[AID] 
Target
Name:
Isoform 2 of Nuclear receptor ROR-alpha (Alpha-2)
Synonyms:
NR1F1 Nuclear receptor ROR-alpha (Alpha-2) RORA RZRA
Type:
PROTEIN
Mol. Mass.:
63033.59
Organism:
Homo sapiens (Human)
Description:
EBI_101591
Residue:
556
  
Inhibitor
Name:
BDBM39556
Synonyms:
5-[[3-(3,5-dimethyl-1-pyrazolyl)-6-methyl-2-quinoxalinyl]amino]-1,3-dihydrobenzimidazol-2-one 5-[[3-(3,5-dimethylpyrazol-1-yl)-6-methylquinoxalin-2-yl]amino]-1,3-dihydrobenzimidazol-2-one MLS000052231 cid_1253520
Type:
Small organic molecule
Emp. Form.:
C21H19N7O
Mol. Mass.:
385.4219
SMILES:
Cc1cc(C)n(n1)-c1nc2cc(C)ccc2nc1Nc1ccc2[nH]c(=O)[nH]c2c1
: