Target
Alkaline phosphatase, germ cell type
Ligand
BDBM32012
Substrate
Meas. Tech.
Luminescent assay for HTS discovery of chemical inhibitors of placental alkaline phosphatase
IC50
11100±840 nM
Citation
 PubChem, PC Luminescent assay for HTS discovery of chemical inhibitors of placental alkaline phosphatase PubChem Bioassay (2007)[AID] 
Target
Name:
Alkaline phosphatase, germ cell type
Synonyms:
ALPG ALPPL2 PPBN_HUMAN | placental-like alkaline phosphatase preproprotein
Type:
PROTEIN
Mol. Mass.:
57374.31
Organism:
Homo sapiens (Human)
Description:
ChEMBL_29964
Residue:
532
  
Inhibitor
Name:
BDBM32012
Synonyms:
1-(3,4-Dihydroxy-phenyl)-2-(5-phenyl-4H-[1,2,4]triazol-3-ylsulfanyl)-ethanone 1-(3,4-dihydroxyphenyl)-2-[(5-phenyl-1H-1,2,4-triazol-3-yl)thio]ethanone CHEMBL358546 SMR000011758 | cid_654283
Type:
Small organic molecule
Emp. Form.:
C16H13N3O3S
Mol. Mass.:
327.358
SMILES:
Oc1ccc(cc1O)C(=O)CSc1nnc([nH]1)-c1ccccc1
: