Target
Alkaline phosphatase, germ cell type
Ligand
BDBM39726
Substrate
Meas. Tech.
Luminescent assay for HTS discovery of chemical inhibitors of placental alkaline phosphatase
IC50
5760±240 nM
Citation
 PubChem, PC Luminescent assay for HTS discovery of chemical inhibitors of placental alkaline phosphatase PubChem Bioassay (2007)[AID] 
Target
Name:
Alkaline phosphatase, germ cell type
Synonyms:
ALPG ALPPL2 PPBN_HUMAN | placental-like alkaline phosphatase preproprotein
Type:
PROTEIN
Mol. Mass.:
57374.31
Organism:
Homo sapiens (Human)
Description:
ChEMBL_29964
Residue:
532
  
Inhibitor
Name:
BDBM39726
Synonyms:
4-[2-[(4-chlorobenzyl)thio]ethyl]pyridine;phosphoric acid 4-[2-[(4-chlorophenyl)methylthio]ethyl]pyridine;phosphoric acid MLS000532615 cid_2827184
Type:
Small organic molecule
Emp. Form.:
C14H14ClNS
Mol. Mass.:
263.786
SMILES:
Clc1ccc(CSCCc2ccncc2)cc1
: