Target
Alkaline phosphatase, germ cell type
Ligand
BDBM39785
Substrate
Meas. Tech.
Luminescent assay for HTS discovery of chemical inhibitors of placental alkaline phosphatase
IC50
3360±300 nM
Citation
 PubChem, PC Luminescent assay for HTS discovery of chemical inhibitors of placental alkaline phosphatase PubChem Bioassay (2007)[AID] 
Target
Name:
Alkaline phosphatase, germ cell type
Synonyms:
ALPG ALPPL2 PPBN_HUMAN | placental-like alkaline phosphatase preproprotein
Type:
PROTEIN
Mol. Mass.:
57374.31
Organism:
Homo sapiens (Human)
Description:
ChEMBL_29964
Residue:
532
  
Inhibitor
Name:
BDBM39785
Synonyms:
2-amino-4-keto-6-methyl-chromene-3-carbaldehyde 2-amino-6-methyl-4-oxo-4H-chromene-3-carbaldehyde 2-azanyl-6-methyl-4-oxidanylidene-chromene-3-carbaldehyde SMR000169115 | cid_1478325
Type:
Small organic molecule
Emp. Form.:
C11H9NO3
Mol. Mass.:
203.1941
SMILES:
Cc1ccc2oc(N)c(C=O)c(=O)c2c1
: