Target
Steroidogenic factor 1
Ligand
BDBM39421
Substrate
Meas. Tech.
Dose-response cell-based assay for activators of the nuclear receptor Steroidogenic Factor 1 (SF-1)
EC50
414±n/a nM
Citation
 PubChem, PC Dose-response cell-based assay for activators of the nuclear receptor Steroidogenic Factor 1 (SF-1) PubChem Bioassay (2007)[AID] 
Target
Name:
Steroidogenic factor 1
Synonyms:
AD4BP FTZF1 NR5A1 SF-1 STF-1 Steroid hormone receptor Ad4BP
Type:
Nuclear Hormone Receptor
Mol. Mass.:
51643.43
Organism:
Homo sapiens (Human)
Description:
Residue:
461
  
Inhibitor
Name:
BDBM39421
Synonyms:
5-Methyl-furan-2-carboxylic acid [5-(4-fluoro-benzyl)-thiazol-2-yl]-amide N-[5-(4-fluorobenzyl)thiazol-2-yl]-5-methyl-2-furamide N-[5-[(4-fluorophenyl)methyl]-1,3-thiazol-2-yl]-5-methylfuran-2-carboxamide SMR000015229 | cid_646081
Type:
Small organic molecule
Emp. Form.:
C16H13FN2O2S
Mol. Mass.:
316.35
SMILES:
Cc1ccc(o1)C(=O)Nc1ncc(Cc2ccc(F)cc2)s1
: