Target
Steroidogenic factor 1
Ligand
BDBM39436
Substrate
Meas. Tech.
Dose-response cell-based assay for activators of the nuclear receptor Steroidogenic Factor 1 (SF-1)
EC50
1693±n/a nM
Citation
 PubChem, PC Dose-response cell-based assay for activators of the nuclear receptor Steroidogenic Factor 1 (SF-1) PubChem Bioassay (2007)[AID] 
Target
Name:
Steroidogenic factor 1
Synonyms:
AD4BP FTZF1 NR5A1 SF-1 STF-1 Steroid hormone receptor Ad4BP
Type:
Nuclear Hormone Receptor
Mol. Mass.:
51643.43
Organism:
Homo sapiens (Human)
Description:
Residue:
461
  
Inhibitor
Name:
BDBM39436
Synonyms:
2-[(4-cyano-1-methyl-5,6,7,8-tetrahydroisoquinolin-3-yl)sulfanyl]-N-(5-ethyl-1,3,4-thiadiazol-2-yl)acetamide 2-[(4-cyano-1-methyl-5,6,7,8-tetrahydroisoquinolin-3-yl)thio]-N-(5-ethyl-1,3,4-thiadiazol-2-yl)acetamide SMR000036715 | cid_612806
Type:
Small organic molecule
Emp. Form.:
C17H19N5OS2
Mol. Mass.:
373.496
SMILES:
CCc1nnc(NC(=O)CSc2nc(C)c3CCCCc3c2C#N)s1
: