Target
Steroidogenic factor 1
Ligand
BDBM39455
Substrate
Meas. Tech.
Dose-response cell-based assay for activators of the nuclear receptor Steroidogenic Factor 1 (SF-1)
EC50
1921±n/a nM
Citation
 PubChem, PC Dose-response cell-based assay for activators of the nuclear receptor Steroidogenic Factor 1 (SF-1) PubChem Bioassay (2007)[AID] 
Target
Name:
Steroidogenic factor 1
Synonyms:
AD4BP FTZF1 NR5A1 SF-1 STF-1 Steroid hormone receptor Ad4BP
Type:
Nuclear Hormone Receptor
Mol. Mass.:
51643.43
Organism:
Homo sapiens (Human)
Description:
Residue:
461
  
Inhibitor
Name:
BDBM39455
Synonyms:
MLS000077990 N-(5-methyl-1,3-thiazol-2-yl)-2-[(5-phenyl-1,3,4-oxadiazol-2-yl)sulfanyl]ethanamide N-(5-methylthiazol-2-yl)-2-[(5-phenyl-1,3,4-oxadiazol-2-yl)thio]acetamide cid_663592
Type:
Small organic molecule
Emp. Form.:
C14H12N4O2S2
Mol. Mass.:
332.401
SMILES:
Cc1cnc(NC(=O)CSc2nnc(o2)-c2ccccc2)s1
: