Target
Steroidogenic factor 1
Ligand
BDBM39460
Substrate
Meas. Tech.
Dose-response cell-based assay for activators of the nuclear receptor Steroidogenic Factor 1 (SF-1)
EC50
585±n/a nM
Citation
 PubChem, PC Dose-response cell-based assay for activators of the nuclear receptor Steroidogenic Factor 1 (SF-1) PubChem Bioassay (2007)[AID] 
Target
Name:
Steroidogenic factor 1
Synonyms:
AD4BP FTZF1 NR5A1 SF-1 STF-1 Steroid hormone receptor Ad4BP
Type:
Nuclear Hormone Receptor
Mol. Mass.:
51643.43
Organism:
Homo sapiens (Human)
Description:
Residue:
461
  
Inhibitor
Name:
BDBM39460
Synonyms:
1-(2,5-dimethyl-1-propyl-3-pyrrolyl)-2-(4-thieno[2,3-d]pyrimidinyloxy)ethanone 1-(2,5-dimethyl-1-propylpyrrol-3-yl)-2-thieno[2,3-d]pyrimidin-4-yloxyethanone SMR000064825 | cid_2614045
Type:
Small organic molecule
Emp. Form.:
C17H19N3O2S
Mol. Mass.:
329.417
SMILES:
CCCn1c(C)cc(C(=O)COc2ncnc3sccc23)c1C
: