Target
Steroidogenic factor 1
Ligand
BDBM39465
Substrate
Meas. Tech.
Dose-response cell-based assay for activators of the nuclear receptor Steroidogenic Factor 1 (SF-1)
EC50
813±n/a nM
Citation
 PubChem, PC Dose-response cell-based assay for activators of the nuclear receptor Steroidogenic Factor 1 (SF-1) PubChem Bioassay (2007)[AID] 
Target
Name:
Steroidogenic factor 1
Synonyms:
AD4BP FTZF1 NR5A1 SF-1 STF-1 Steroid hormone receptor Ad4BP
Type:
Nuclear Hormone Receptor
Mol. Mass.:
51643.43
Organism:
Homo sapiens (Human)
Description:
Residue:
461
  
Inhibitor
Name:
BDBM39465
Synonyms:
3-hydroxy-1-adamantanecarboxylic acid [2-[1-(2-methoxyethyl)-2,5-dimethyl-3-pyrrolyl]-2-oxoethyl] ester MLS000056958 [2-[1-(2-methoxyethyl)-2,5-dimethyl-pyrrol-3-yl]-2-oxidanylidene-ethyl] 3-oxidanyladamantane-1-carboxylate cid_2998485
Type:
Small organic molecule
Emp. Form.:
C22H31NO5
Mol. Mass.:
389.4852
SMILES:
[H]C12CC3([H])CC(O)(C1)CC(C2)(C3)C(=O)OCC(=O)c1cc(C)n(CCOC)c1C
: