Target
Steroidogenic factor 1
Ligand
BDBM32096
Substrate
Meas. Tech.
Dose-response cell-based assay for activators of the nuclear receptor Steroidogenic Factor 1 (SF-1)
EC50
760±n/a nM
Citation
 PubChem, PC Dose-response cell-based assay for activators of the nuclear receptor Steroidogenic Factor 1 (SF-1) PubChem Bioassay (2007)[AID] 
Target
Name:
Steroidogenic factor 1
Synonyms:
AD4BP FTZF1 NR5A1 SF-1 STF-1 Steroid hormone receptor Ad4BP
Type:
Nuclear Hormone Receptor
Mol. Mass.:
51643.43
Organism:
Homo sapiens (Human)
Description:
Residue:
461
  
Inhibitor
Name:
BDBM32096
Synonyms:
(6-phenyl-4,5-dihydropyrazolo[4,3-e][1,3]benzothiazol-2-yl)amine 6-phenyl-5,6-dihydro-4H-[1,3]thiazolo[4,5-e]indazol-2-amine SMR000021277 | cid_712700
Type:
Small organic molecule
Emp. Form.:
C14H12N4S
Mol. Mass.:
268.337
SMILES:
Nc1nc-2c(CCc3c-2cnn3-c2ccccc2)s1
: