Target
Steroidogenic factor 1
Ligand
BDBM37244
Substrate
Meas. Tech.
Dose-response cell-based assay for activators of the nuclear receptor Steroidogenic Factor 1 (SF-1)
EC50
>11000±n/a nM
Citation
 PubChem, PC Dose-response cell-based assay for activators of the nuclear receptor Steroidogenic Factor 1 (SF-1) PubChem Bioassay (2007)[AID] 
Target
Name:
Steroidogenic factor 1
Synonyms:
AD4BP FTZF1 NR5A1 SF-1 STF-1 Steroid hormone receptor Ad4BP
Type:
Nuclear Hormone Receptor
Mol. Mass.:
51643.43
Organism:
Homo sapiens (Human)
Description:
Residue:
461
  
Inhibitor
Name:
BDBM37244
Synonyms:
2-[(1H-indazol-5-ylamino)methylene]-5,5-dimethyl-cyclohexane-1,3-quinone 2-[(1H-indazol-5-ylamino)methylidene]-5,5-dimethylcyclohexane-1,3-dione SMR000111453 | cid_870804
Type:
Small organic molecule
Emp. Form.:
C16H17N3O2
Mol. Mass.:
283.3251
SMILES:
CC1(C)CC(=O)C(=CNc2ccc3[nH]ncc3c2)C(=O)C1
: