Target
Steroidogenic factor 1
Ligand
BDBM39559
Substrate
Meas. Tech.
Counterscreen for activators of the Retinoic Acid Receptor-related orphan receptor A (RORA): A cell-based dose-response assay for inhibition of the Steroidogenic Factor 1 (SF-1)
EC50
7666±n/a nM
Citation
 PubChem, PC Counterscreen for activators of the Retinoic Acid Receptor-related orphan receptor A (RORA): A cell-based dose-response assay for inhibition of the Steroidogenic Factor 1 (SF-1) PubChem Bioassay (2007)[AID] 
Target
Name:
Steroidogenic factor 1
Synonyms:
AD4BP FTZF1 NR5A1 SF-1 STF-1 Steroid hormone receptor Ad4BP
Type:
Nuclear Hormone Receptor
Mol. Mass.:
51643.43
Organism:
Homo sapiens (Human)
Description:
Residue:
461
  
Inhibitor
Name:
BDBM39559
Synonyms:
2-methoxyethyl 6-(2,5-dimethoxyphenyl)-3-methyl-4-oxidanylidene-1,5,6,7-tetrahydroindole-2-carboxylate 6-(2,5-dimethoxyphenyl)-3-methyl-4-oxo-1,5,6,7-tetrahydroindole-2-carboxylic acid 2-methoxyethyl ester MLS000115999 cid_4274895
Type:
Small organic molecule
Emp. Form.:
C21H25NO6
Mol. Mass.:
387.4263
SMILES:
COCCOC(=O)c1[nH]c2CC(CC(=O)c2c1C)c1cc(OC)ccc1OC
: