Target
14-3-3 protein gamma
Ligand
BDBM39875
Substrate
Meas. Tech.
14-3-3 protein interaction modulators Dose Response Confirmation
IC50
50000±n/a nM
Citation
 PubChem, PC 14-3-3 protein interaction modulators Dose Response Confirmation PubChem Bioassay (2007)[AID] 
Target
Name:
14-3-3 protein gamma
Synonyms:
1433G_HUMAN tyrosine 3-monooxygenase/tryptophan 5-monooxygenase activation protein, gamma polypeptide
Type:
Enzyme Catalytic Domain
Mol. Mass.:
28289.17
Organism:
Homo sapiens (Human)
Description:
gi_21464101
Residue:
247
  
Inhibitor
Name:
BDBM39875
Synonyms:
5-[(2-methylbenzyl)sulfonylmethyl]-N-(2-pyridylmethyl)-2-furamide 5-[(2-methylphenyl)methylsulfonylmethyl]-N-(pyridin-2-ylmethyl)furan-2-carboxamide MLS000046429 cid_3235971
Type:
Small organic molecule
Emp. Form.:
C20H20N2O4S
Mol. Mass.:
384.449
SMILES:
Cc1ccccc1CS(=O)(=O)Cc1ccc(o1)C(=O)NCc1ccccn1
: