Target
Coagulation factor XII
Ligand
BDBM32778
Substrate
Meas. Tech.
Factor XIIa Dose Response Confirmation
IC50
7623.52±112.749433 nM
Citation
 PubChem, PC Factor XIIa Dose Response Confirmation PubChem Bioassay (2008)[AID] 
Target
Name:
Coagulation factor XII
Synonyms:
Beta-factor XIIa part 1 Carboxylesterase 2 (intestine, liver) Coagulation factor XII (FXII) Coagulation factor XIIa light chain FA12_HUMAN Factor XIIa (fXIIa) Hageman factor
Type:
Enzyme
Mol. Mass.:
67810.07
Organism:
Homo sapiens (Human)
Description:
P00748
Residue:
615
  
Inhibitor
Name:
BDBM32778
Synonyms:
MLS000081703 [2-(2-cyanoethyl)-5-methyl-pyrazol-3-yl] benzoate benzoic acid [2-(2-cyanoethyl)-5-methyl-3-pyrazolyl] ester cid_2366780
Type:
Small organic molecule
Emp. Form.:
C14H13N3O2
Mol. Mass.:
255.2719
SMILES:
Cc1cc(OC(=O)c2ccccc2)n(CCC#N)n1
: