Target
Coagulation factor XII
Ligand
BDBM40354
Substrate
Meas. Tech.
Factor XIIa Dose Response Confirmation
IC50
>50000±0 nM
Citation
 PubChem, PC Factor XIIa Dose Response Confirmation PubChem Bioassay (2008)[AID] 
Target
Name:
Coagulation factor XII
Synonyms:
Beta-factor XIIa part 1 Carboxylesterase 2 (intestine, liver) Coagulation factor XII (FXII) Coagulation factor XIIa light chain FA12_HUMAN Factor XIIa (fXIIa) Hageman factor
Type:
Enzyme
Mol. Mass.:
67810.07
Organism:
Homo sapiens (Human)
Description:
P00748
Residue:
615
  
Inhibitor
Name:
BDBM40354
Synonyms:
4-(4-carbethoxypiperazino)-5-methyl-thieno[2,3-d]pyrimidine-6-carboxylic acid ethyl ester MLS000046984 cid_3236381 ethyl 4-(4-ethoxycarbonylpiperazin-1-yl)-5-methylthieno[2,3-d]pyrimidine-6-carboxylate | ethyl 4-[4-(ethoxycarbonyl)piperazin-1-yl]-5-methylthieno[2,3-d]pyrimidine-6-carboxylate
Type:
Small organic molecule
Emp. Form.:
C17H22N4O4S
Mol. Mass.:
378.446
SMILES:
CCOC(=O)N1CCN(CC1)c1ncnc2sc(C(=O)OCC)c(C)c12
: