Target
Coagulation factor XII
Ligand
BDBM40371
Substrate
Meas. Tech.
Factor XIIa Dose Response Confirmation
IC50
>50000±0 nM
Citation
 PubChem, PC Factor XIIa Dose Response Confirmation PubChem Bioassay (2008)[AID] 
Target
Name:
Coagulation factor XII
Synonyms:
Beta-factor XIIa part 1 Carboxylesterase 2 (intestine, liver) Coagulation factor XII (FXII) Coagulation factor XIIa light chain FA12_HUMAN Factor XIIa (fXIIa) Hageman factor
Type:
Enzyme
Mol. Mass.:
67810.07
Organism:
Homo sapiens (Human)
Description:
P00748
Residue:
615
  
Inhibitor
Name:
BDBM40371
Synonyms:
2,2-dimethylpropanoic acid [5-amino-1-(benzenesulfonyl)-3-pyrazolyl] ester 5-amino-1-(phenylsulfonyl)-1H-pyrazol-3-yl pivalate SMR000021563 [5-azanyl-1-(phenylsulfonyl)pyrazol-3-yl] 2,2-dimethylpropanoate | cid_3243640
Type:
Small organic molecule
Emp. Form.:
C14H17N3O4S
Mol. Mass.:
323.367
SMILES:
CC(C)(C)C(=O)Oc1cc(N)n(n1)S(=O)(=O)c1ccccc1
: