Target
N-formyl peptide receptor 2
Ligand
BDBM40410
Substrate
Meas. Tech.
Formylpeptide Receptor (FPR) Ligand Structure Activity Relationship (SAR) Analysis : Dose Response Assay Counterscreen Against Formyl Peptide Receptor-Like-1 (FPRL1)
Ki
>40300±n/a nM
Citation
 PubChem, PC Formylpeptide Receptor (FPR) Ligand Structure Activity Relationship (SAR) Analysis : Dose Response Assay Counterscreen Against Formyl Peptide Receptor-Like-1 (FPRL1)  PubChem Bioassay (2007)[AID] 
Target
Name:
N-formyl peptide receptor 2
Synonyms:
ALXR, FPRL1, FPR2 FPR2 FPRH1 Formyl Peptide Receptor-Like 1 LXA4 receptor Lipoxin A4 receptor RFP | hFPRL
Type:
G Protein-Coupled Receptor (GPCR)
Mol. Mass.:
38968.35
Organism:
Homo sapiens (Human)
Description:
P25090
Residue:
351
  
Inhibitor
Name:
BDBM40410
Synonyms:
(4E)-4-[hydroxy(phenyl)methylene]-5-p-cumenyl-1-(3-pyridylmethyl)pyrrolidine-2,3-quinone (4E)-4-[hydroxy(phenyl)methylidene]-5-(4-propan-2-ylphenyl)-1-(pyridin-3-ylmethyl)pyrrolidine-2,3-dione UNM000003538401 | cid_5345630
Type:
Small organic molecule
Emp. Form.:
C26H24N2O3
Mol. Mass.:
412.4804
SMILES:
CC(C)c1ccc(cc1)C1C(C(=O)c2ccccc2)C(=O)C(=O)N1Cc1cccnc1
: