Target
N-formyl peptide receptor 2
Ligand
BDBM40418
Substrate
Meas. Tech.
Formylpeptide Receptor (FPR) Ligand Structure Activity Relationship (SAR) Analysis : Dose Response Assay Counterscreen Against Formyl Peptide Receptor-Like-1 (FPRL1)
Ki
>40300±n/a nM
Citation
 PubChem, PC Formylpeptide Receptor (FPR) Ligand Structure Activity Relationship (SAR) Analysis : Dose Response Assay Counterscreen Against Formyl Peptide Receptor-Like-1 (FPRL1)  PubChem Bioassay (2007)[AID] 
Target
Name:
N-formyl peptide receptor 2
Synonyms:
ALXR, FPRL1, FPR2 FPR2 FPRH1 Formyl Peptide Receptor-Like 1 LXA4 receptor Lipoxin A4 receptor RFP | hFPRL
Type:
G Protein-Coupled Receptor (GPCR)
Mol. Mass.:
38968.35
Organism:
Homo sapiens (Human)
Description:
P25090
Residue:
351
  
Inhibitor
Name:
BDBM40418
Synonyms:
2-(2,4-dimethoxyphenyl)-1-(2-morpholin-4-ylethyl)-4-oxidanyl-3-thiophen-2-ylcarbonyl-2H-pyrrol-5-one 2-(2,4-dimethoxyphenyl)-4-hydroxy-1-[2-(4-morpholinyl)ethyl]-3-[oxo(thiophen-2-yl)methyl]-2H-pyrrol-5-one UNM000003551201 | cid_15996528
Type:
Small organic molecule
Emp. Form.:
C23H26N2O6S
Mol. Mass.:
458.527
SMILES:
COc1ccc(C2C(C(=O)c3cccs3)C(=O)C(=O)N2CCN2CCOCC2)c(OC)c1
: