Target
N-formyl peptide receptor 2
Ligand
BDBM40441
Substrate
Meas. Tech.
Formylpeptide Receptor (FPR) Ligand Structure Activity Relationship (SAR) Analysis : Dose Response Assay Counterscreen Against Formyl Peptide Receptor-Like-1 (FPRL1)
Ki
>40300±n/a nM
Citation
 PubChem, PC Formylpeptide Receptor (FPR) Ligand Structure Activity Relationship (SAR) Analysis : Dose Response Assay Counterscreen Against Formyl Peptide Receptor-Like-1 (FPRL1)  PubChem Bioassay (2007)[AID] 
Target
Name:
N-formyl peptide receptor 2
Synonyms:
ALXR, FPRL1, FPR2 FPR2 FPRH1 Formyl Peptide Receptor-Like 1 LXA4 receptor Lipoxin A4 receptor RFP | hFPRL
Type:
G Protein-Coupled Receptor (GPCR)
Mol. Mass.:
38968.35
Organism:
Homo sapiens (Human)
Description:
P25090
Residue:
351
  
Inhibitor
Name:
BDBM40441
Synonyms:
(Z)-2-[(3-cyano-5,6-dihydro-4H-cyclopenta[b]thiophen-2-yl)amino]-4-keto-4-phenyl-but-2-enoic acid (Z)-2-[(3-cyano-5,6-dihydro-4H-cyclopenta[b]thiophen-2-yl)amino]-4-oxo-4-phenyl-2-butenoic acid UNM000003600601 | cid_5292563
Type:
Small organic molecule
Emp. Form.:
C18H14N2O3S
Mol. Mass.:
338.38
SMILES:
OC(=O)C(CC(=O)c1ccccc1)=Nc1sc2CCCc2c1C#N
: