Target
N-formyl peptide receptor 2
Ligand
BDBM40453
Substrate
Meas. Tech.
Formylpeptide Receptor (FPR) Ligand Structure Activity Relationship (SAR) Analysis : Dose Response Assay Counterscreen Against Formyl Peptide Receptor-Like-1 (FPRL1)
Ki
>40300±n/a nM
Citation
 PubChem, PC Formylpeptide Receptor (FPR) Ligand Structure Activity Relationship (SAR) Analysis : Dose Response Assay Counterscreen Against Formyl Peptide Receptor-Like-1 (FPRL1)  PubChem Bioassay (2007)[AID] 
Target
Name:
N-formyl peptide receptor 2
Synonyms:
ALXR, FPRL1, FPR2 FPR2 FPRH1 Formyl Peptide Receptor-Like 1 LXA4 receptor Lipoxin A4 receptor RFP | hFPRL
Type:
G Protein-Coupled Receptor (GPCR)
Mol. Mass.:
38968.35
Organism:
Homo sapiens (Human)
Description:
P25090
Residue:
351
  
Inhibitor
Name:
BDBM40453
Synonyms:
N-(2,5-dimethoxybenzyl)-2-(2-keto-1,3-benzothiazol-3-yl)acetamide N-[(2,5-dimethoxyphenyl)methyl]-2-(2-oxo-1,3-benzothiazol-3-yl)acetamide cid_16043775
Type:
Small organic molecule
Emp. Form.:
C18H18N2O4S
Mol. Mass.:
358.412
SMILES:
COc1ccc(OC)c(CNC(=O)Cn2c3ccccc3sc2=O)c1
: