Target
fMet-Leu-Phe receptor
Ligand
BDBM40451
Substrate
Meas. Tech.
Formylpeptide Receptor (FPR) Ligand Structure Activity Relationship (SAR) Analysis : Dose Response Assay
Ki
>44300±n/a nM
Citation
 PubChem, PC Formylpeptide Receptor (FPR) Ligand Structure Activity Relationship (SAR) Analysis : Dose Response Assay PubChem Bioassay (2007)[AID] 
Target
Name:
fMet-Leu-Phe receptor
Synonyms:
FPR FPR1_HUMAN N-formyl peptide receptor 1 fMLP receptor formyl peptide receptor 1
Type:
Enzyme Catalytic Domain
Mol. Mass.:
38456.14
Organism:
Homo sapiens (Human)
Description:
gi_4503779
Residue:
350
  
Inhibitor
Name:
BDBM40451
Synonyms:
2-[acetyl(2-thenyl)amino]-N-cyclohexyl-2-methyl-butyramide N-cyclohexyl-2-[ethanoyl(thiophen-2-ylmethyl)amino]-2-methyl-butanamide cid_4535556
Type:
Small organic molecule
Emp. Form.:
C18H28N2O2S
Mol. Mass.:
336.492
SMILES:
CCC(C)(N(Cc1cccs1)C(C)=O)C(=O)NC1CCCCC1
: