Target
Sphingosine 1-phosphate receptor 3
Ligand
BDBM31008
Substrate
Meas. Tech.
S1P3 Dose Response Assay Counterscreen for 5-Hydroxytryptamine(Serotonin) Receptor Subtype 1E Agonists
EC50
>40000±n/a nM
Citation
 PubChem, PC S1P3 Dose Response Assay Counterscreen for 5-Hydroxytryptamine(Serotonin) Receptor Subtype 1E Agonists PubChem Bioassay (2007)[AID] 
Target
Name:
Sphingosine 1-phosphate receptor 3
Synonyms:
C9orf108 EDG3 S1P receptor 3 S1P3 S1PR3_HUMAN Sphingosine 1-phosphate receptor 3 (S1P3) | Sphingosine 1-phosphate receptor Edg-3
Type:
G Protein-Coupled Receptor (GPCR)
Mol. Mass.:
42278.13
Organism:
Homo sapiens (Human)
Description:
Q99500
Residue:
378
  
Inhibitor
Name:
BDBM31008
Synonyms:
MLS000036322 N-[1-[3-(dimethylamino)propyl]benzimidazol-2-yl]cyclohexanecarboxamide cid_660499
Type:
Small organic molecule
Emp. Form.:
C19H28N4O
Mol. Mass.:
328.4518
SMILES:
CN(C)CCCn1c(NC(=O)C2CCCCC2)nc2ccccc12
: