Target
Collagenase 3
Ligand
BDBM50247260
Substrate
Meas. Tech.
Dose-response biochemical assay for inhibitors of Matrix Metalloproteinase 13 (MMP13) activity
IC50
12620±n/a nM
Citation
 PubChem, PC Dose-response biochemical assay for inhibitors of Matrix Metalloproteinase 13 (MMP13) activity PubChem Bioassay (2007)[AID] 
Target
Name:
Collagenase 3
Synonyms:
MMP-13 MMP13_HUMAN Matrix metalloproteinase-13 (MMP-13) | Matrix metalloproteinase-13 (MMP13)
Type:
Enzyme
Mol. Mass.:
53808.06
Organism:
Homo sapiens (Human)
Description:
P45452
Residue:
471
  
Inhibitor
Name:
BDBM50247260
Synonyms:
3-ethyl-5-(1-methylpyridin-2(1H)-ylidene)-2-thioxothiazolidin-4-one cid_1870548
Type:
Small organic molecule
Emp. Form.:
C11H12N2OS2
Mol. Mass.:
252.356
SMILES:
CCN1C(=S)S\C(C1=O)=C1/C=CC=CN1C
: