Target
Collagenase 3
Ligand
BDBM50247466
Substrate
Meas. Tech.
Dose-response biochemical assay for inhibitors of Matrix Metalloproteinase 13 (MMP13) activity
IC50
10300±n/a nM
Citation
 PubChem, PC Dose-response biochemical assay for inhibitors of Matrix Metalloproteinase 13 (MMP13) activity PubChem Bioassay (2007)[AID] 
Target
Name:
Collagenase 3
Synonyms:
MMP-13 MMP13_HUMAN Matrix metalloproteinase-13 (MMP-13) | Matrix metalloproteinase-13 (MMP13)
Type:
Enzyme
Mol. Mass.:
53808.06
Organism:
Homo sapiens (Human)
Description:
P45452
Residue:
471
  
Inhibitor
Name:
BDBM50247466
Synonyms:
CHEMBL462629 ethyl 2-cyano-2-(quinoxalin-2(1H)-ylidene)acetate
Type:
Small organic molecule
Emp. Form.:
C13H11N3O2
Mol. Mass.:
241.2453
SMILES:
CCOC(=O)C(C#N)c1cnc2ccccc2n1
: