Target
Estrogen receptor
Ligand
BDBM40479
Substrate
Meas. Tech.
Estrogen Receptor-alpha Coactivator Binding Potentiators Dose Response Confirmation
EC50
12500±n/a nM
Citation
 PubChem, PC Estrogen Receptor-alpha Coactivator Binding Potentiators Dose Response Confirmation PubChem Bioassay (2007)[AID] 
Target
Name:
Estrogen receptor
Synonyms:
ER ESR ESR1_HUMAN Estrogen receptor Estrogen receptor (ER-alpha) Estrogen receptor alpha (ER) Nuclear receptor subfamily 3 group A member 1
Type:
Protein
Mol. Mass.:
66230.44
Organism:
Homo sapiens (Human)
Description:
P03372
Residue:
595
  
Inhibitor
Name:
BDBM40479
Synonyms:
3-(2-Phenyl-imidazol-1-yl)-propionic acid 3-(2-phenylimidazol-1-yl)propanoic acid MLS000071948 cid_644448
Type:
Small organic molecule
Emp. Form.:
C12H12N2O2
Mol. Mass.:
216.2359
SMILES:
OC(=O)CCn1ccnc1-c1ccccc1
: