Target
Estrogen receptor
Ligand
BDBM40499
Substrate
Meas. Tech.
Estrogen Receptor-alpha Coactivator Binding Potentiators Dose Response Confirmation
EC50
12796.55±n/a nM
Citation
 PubChem, PC Estrogen Receptor-alpha Coactivator Binding Potentiators Dose Response Confirmation PubChem Bioassay (2007)[AID] 
Target
Name:
Estrogen receptor
Synonyms:
ER ESR ESR1_HUMAN Estrogen receptor Estrogen receptor (ER-alpha) Estrogen receptor alpha (ER) Nuclear receptor subfamily 3 group A member 1
Type:
Protein
Mol. Mass.:
66230.44
Organism:
Homo sapiens (Human)
Description:
P03372
Residue:
595
  
Inhibitor
Name:
BDBM40499
Synonyms:
MLS000054352 [1-(4-chlorophenyl)-3-methyl-5-thieno[2,3-c]pyrazolyl]-[4-(2-pyridinyl)-1-piperazinyl]methanone [1-(4-chlorophenyl)-3-methyl-thieno[2,3-c]pyrazol-5-yl]-[4-(2-pyridyl)piperazino]methanone cid_2997981
Type:
Small organic molecule
Emp. Form.:
C22H20ClN5OS
Mol. Mass.:
437.945
SMILES:
Cc1nn(-c2ccc(Cl)cc2)c2sc(cc12)C(=O)N1CCN(CC1)c1ccccn1
: