Target
Estrogen receptor
Ligand
BDBM40503
Substrate
Meas. Tech.
Estrogen Receptor-alpha Coactivator Binding Potentiators Dose Response Confirmation
EC50
23091.6±n/a nM
Citation
 PubChem, PC Estrogen Receptor-alpha Coactivator Binding Potentiators Dose Response Confirmation PubChem Bioassay (2007)[AID] 
Target
Name:
Estrogen receptor
Synonyms:
ER ESR ESR1_HUMAN Estrogen receptor Estrogen receptor (ER-alpha) Estrogen receptor alpha (ER) Nuclear receptor subfamily 3 group A member 1
Type:
Protein
Mol. Mass.:
66230.44
Organism:
Homo sapiens (Human)
Description:
P03372
Residue:
595
  
Inhibitor
Name:
BDBM40503
Synonyms:
(3,5-dimethyl-1,2-oxazol-4-yl)methyl 4-methylthieno[2,3-b]indole-2-carboxylate 4-methylthien[2,3-b]indole-2-carboxylic acid (3,5-dimethylisoxazol-4-yl)methyl ester SMR000067420 | cid_2107577
Type:
Small organic molecule
Emp. Form.:
C18H16N2O3S
Mol. Mass.:
340.396
SMILES:
Cc1noc(C)c1COC(=O)c1cc2c3ccccc3n(C)c2s1
: