Target
Estrogen receptor
Ligand
BDBM40527
Substrate
Meas. Tech.
Estrogen Receptor-alpha Coactivator Binding Potentiators Dose Response Confirmation
EC50
3273.29±n/a nM
Citation
 PubChem, PC Estrogen Receptor-alpha Coactivator Binding Potentiators Dose Response Confirmation PubChem Bioassay (2007)[AID] 
Target
Name:
Estrogen receptor
Synonyms:
ER ESR ESR1_HUMAN Estrogen receptor Estrogen receptor (ER-alpha) Estrogen receptor alpha (ER) Nuclear receptor subfamily 3 group A member 1
Type:
Protein
Mol. Mass.:
66230.44
Organism:
Homo sapiens (Human)
Description:
P03372
Residue:
595
  
Inhibitor
Name:
BDBM40527
Synonyms:
8-[[[3-(2-furanylmethyl)-4-oxo-2-quinazolinyl]thio]methyl]-4H-1,3-benzodioxin-6-carboxylic acid ethyl ester MLS000088725 cid_1309539 ethyl 8-[[3-(furan-2-ylmethyl)-4-oxidanylidene-quinazolin-2-yl]sulfanylmethyl]-4H-1,3-benzodioxine-6-carboxylate | ethyl 8-[[3-(furan-2-ylmethyl)-4-oxoquinazolin-2-yl]sulfanylmethyl]-4H-1,3-benzodioxine-6-carboxylate
Type:
Small organic molecule
Emp. Form.:
C25H22N2O6S
Mol. Mass.:
478.517
SMILES:
CCOC(=O)c1cc(CSc2nc3ccccc3c(=O)n2Cc2ccco2)c2OCOCc2c1
: