Target
Estrogen receptor
Ligand
BDBM40546
Substrate
Meas. Tech.
Estrogen Receptor-alpha Coactivator Binding Potentiators Dose Response Confirmation
EC50
12782.06±n/a nM
Citation
 PubChem, PC Estrogen Receptor-alpha Coactivator Binding Potentiators Dose Response Confirmation PubChem Bioassay (2007)[AID] 
Target
Name:
Estrogen receptor
Synonyms:
ER ESR ESR1_HUMAN Estrogen receptor Estrogen receptor (ER-alpha) Estrogen receptor alpha (ER) Nuclear receptor subfamily 3 group A member 1
Type:
Protein
Mol. Mass.:
66230.44
Organism:
Homo sapiens (Human)
Description:
P03372
Residue:
595
  
Inhibitor
Name:
BDBM40546
Synonyms:
5-bromanyl-N-[6-[(5-bromanylthiophen-2-yl)carbonylamino]hexyl]thiophene-2-carboxamide 5-bromo-N-[6-[(5-bromothiophene-2-carbonyl)amino]hexyl]thiophene-2-carboxamide MLS000550619 cid_4989136
Type:
Small organic molecule
Emp. Form.:
C16H18Br2N2O2S2
Mol. Mass.:
494.264
SMILES:
Brc1ccc(s1)C(=O)NCCCCCCNC(=O)c1ccc(Br)s1
: