Target
Estrogen receptor
Ligand
BDBM40548
Substrate
Meas. Tech.
Estrogen Receptor-alpha Coactivator Binding Potentiators Dose Response Confirmation
EC50
8472.51±n/a nM
Citation
 PubChem, PC Estrogen Receptor-alpha Coactivator Binding Potentiators Dose Response Confirmation PubChem Bioassay (2007)[AID] 
Target
Name:
Estrogen receptor
Synonyms:
ER ESR ESR1_HUMAN Estrogen receptor Estrogen receptor (ER-alpha) Estrogen receptor alpha (ER) Nuclear receptor subfamily 3 group A member 1
Type:
Protein
Mol. Mass.:
66230.44
Organism:
Homo sapiens (Human)
Description:
P03372
Residue:
595
  
Inhibitor
Name:
BDBM40548
Synonyms:
2-(1-Benzo[1,3]dioxol-5-yl-1H-tetrazol-5-ylsulfanyl)-N-(3,4-dimethyl-phenyl)-acetamide 2-[[1-(1,3-benzodioxol-5-yl)-1,2,3,4-tetrazol-5-yl]sulfanyl]-N-(3,4-dimethylphenyl)ethanamide 2-[[1-(1,3-benzodioxol-5-yl)tetrazol-5-yl]thio]-N-(3,4-dimethylphenyl)acetamide SMR000118747 | cid_1175681
Type:
Small organic molecule
Emp. Form.:
C18H17N5O3S
Mol. Mass.:
383.424
SMILES:
Cc1ccc(NC(=O)CSc2nnnn2-c2ccc3OCOc3c2)cc1C
: