Target
Estrogen receptor
Ligand
BDBM40251
Substrate
Meas. Tech.
Estrogen Receptor-alpha Coactivator Binding Potentiators Dose Response Confirmation
EC50
12491.77±n/a nM
Citation
 PubChem, PC Estrogen Receptor-alpha Coactivator Binding Potentiators Dose Response Confirmation PubChem Bioassay (2007)[AID] 
Target
Name:
Estrogen receptor
Synonyms:
ER ESR ESR1_HUMAN Estrogen receptor Estrogen receptor (ER-alpha) Estrogen receptor alpha (ER) Nuclear receptor subfamily 3 group A member 1
Type:
Protein
Mol. Mass.:
66230.44
Organism:
Homo sapiens (Human)
Description:
P03372
Residue:
595
  
Inhibitor
Name:
BDBM40251
Synonyms:
2-(4-fluoroanilino)-6-[(1-phenyltetrazol-5-yl)sulfanylmethyl]-1H-pyrimidin-4-one 2-(4-fluoroanilino)-6-[[(1-phenyltetrazol-5-yl)thio]methyl]-1H-pyrimidin-4-one 2-[(4-fluorophenyl)amino]-6-{[(1-phenyl-1H-tetrazol-5-yl)thio]methyl}-4(3H)-pyrimidinone SMR000135863 | cid_1214378
Type:
Small organic molecule
Emp. Form.:
C18H14FN7OS
Mol. Mass.:
395.413
SMILES:
Fc1ccc(Nc2nc(CSc3nnnn3-c3ccccc3)cc(=O)[nH]2)cc1
: