Target
Nuclear receptor subfamily 4 group A member 1
Ligand
BDBM40632
Substrate
Meas. Tech.
High Throughput Fluorescence Polarization Screen for Bcl-B Phenotype Converters
IC50
>6250±0 nM
Citation
 PubChem, PC High Throughput Fluorescence Polarization Screen for Bcl-B Phenotype Converters PubChem Bioassay (2008)[AID] 
Target
Name:
Nuclear receptor subfamily 4 group A member 1
Synonyms:
GFRP1 NAK1 NR4A1_HUMAN | nuclear receptor subfamily 4, group A, member 1
Type:
Enzyme Catalytic Domain
Mol. Mass.:
64467.13
Organism:
Homo sapiens (Human)
Description:
gi_27894344
Residue:
598
  
Inhibitor
Name:
BDBM40632
Synonyms:
(3R,4S,5S)-2-(6,8-dimethyl-1-pyrrolo[2,3-g]quinolinyl)oxane-3,4,5-triol;hydrochloride (3R,4S,5S)-2-(6,8-dimethylpyrrolo[2,3-g]quinolin-1-yl)tetrahydropyran-3,4,5-triol;hydrochloride SMR000033958 cid_6602841
Type:
Small organic molecule
Emp. Form.:
C18H20N2O4
Mol. Mass.:
328.3624
SMILES:
Cc1cc(C)c2cc3n(ccc3cc2n1)C1OC[C@H](O)[C@H](O)[C@H]1O
: