Target
Nuclear receptor subfamily 4 group A member 1
Ligand
BDBM31755
Substrate
Meas. Tech.
High Throughput Fluorescence Polarization Screen for Bcl-B Phenotype Converters
IC50
5548.3±278 nM
Citation
 PubChem, PC High Throughput Fluorescence Polarization Screen for Bcl-B Phenotype Converters PubChem Bioassay (2008)[AID] 
Target
Name:
Nuclear receptor subfamily 4 group A member 1
Synonyms:
GFRP1 NAK1 NR4A1_HUMAN | nuclear receptor subfamily 4, group A, member 1
Type:
Enzyme Catalytic Domain
Mol. Mass.:
64467.13
Organism:
Homo sapiens (Human)
Description:
gi_27894344
Residue:
598
  
Inhibitor
Name:
BDBM31755
Synonyms:
3-(benzylthio)-5,6-bis(2-furyl)-1,2,4-triazine 5,6-bis(2-furanyl)-3-(phenylmethylthio)-1,2,4-triazine MLS-0029114.0001 | cid_2940938
Type:
Small organic molecule
Emp. Form.:
C18H13N3O2S
Mol. Mass.:
335.38
SMILES:
C(Sc1nnc(-c2ccco2)c(n1)-c1ccco1)c1ccccc1
: