Target
Nuclear receptor subfamily 4 group A member 1
Ligand
BDBM34712
Substrate
Meas. Tech.
High Throughput Fluorescence Polarization Screen for Bcl-B Phenotype Converters
IC50
492.62±74.7 nM
Citation
 PubChem, PC High Throughput Fluorescence Polarization Screen for Bcl-B Phenotype Converters PubChem Bioassay (2008)[AID] 
Target
Name:
Nuclear receptor subfamily 4 group A member 1
Synonyms:
GFRP1 NAK1 NR4A1_HUMAN | nuclear receptor subfamily 4, group A, member 1
Type:
Enzyme Catalytic Domain
Mol. Mass.:
64467.13
Organism:
Homo sapiens (Human)
Description:
gi_27894344
Residue:
598
  
Inhibitor
Name:
BDBM34712
Synonyms:
6,7-bis(oxidanyl)-4-[[5-(3,4,5-trimethoxyphenyl)-1,3,4-oxadiazol-2-yl]sulfanylmethyl]chromen-2-one 6,7-dihydroxy-4-[[[5-(3,4,5-trimethoxyphenyl)-1,3,4-oxadiazol-2-yl]thio]methyl]-1-benzopyran-2-one MLS000565663 cid_5689963
Type:
Small organic molecule
Emp. Form.:
C21H18N2O8S
Mol. Mass.:
458.441
SMILES:
COc1cc(cc(OC)c1OC)-c1nnc(SCc2cc(=O)oc3cc(O)c(O)cc23)o1
: