Target
Heat shock protein HSP 90-alpha
Ligand
BDBM32168
Substrate
Meas. Tech.
Cell-based secondary assay for identifying Hsp90 inhibitors that degrade Hsp90 client protein Her2
IC50
>60000±n/a nM
Citation
 PubChem, PC Cell-based secondary assay for identifying Hsp90 inhibitors that degrade Hsp90 client protein Her2 PubChem Bioassay (2007)[AID] 
Target
Name:
Heat shock protein HSP 90-alpha
Synonyms:
HS90A_HUMAN HSP86 HSP90AA1 HSPCA Heat shock 86 kDa Heat shock protein HSP 90-alpha (HSP90) LAP-2 Lipopolysaccharide-associated protein 2 heat shock protein 90kDa alpha (cytosolic), class A member 1 isoform 2
Type:
Molecular Chaperone
Mol. Mass.:
84623.45
Organism:
Homo sapiens (Human)
Description:
P07900
Residue:
732
  
Inhibitor
Name:
BDBM32168
Synonyms:
2,5-bis(chloranyl)-N-[3-(2-hydroxyphenyl)-4-oxidanyl-phenyl]benzenesulfonamide TG2-90-1 | cid_16072262
Type:
Small organic molecule
Emp. Form.:
C18H13Cl2NO4S
Mol. Mass.:
410.271
SMILES:
Oc1ccccc1-c1cc(NS(=O)(=O)c2cc(Cl)ccc2Cl)ccc1O
: