Target
fMet-Leu-Phe receptor
Ligand
BDBM40751
Substrate
Meas. Tech.
Formylpeptide Receptor (FPRL1) Ligand Structure Activity Relationship (SAR) Analysis : FPR Dose Response Counterscreen Assay
Ki
>39900±n/a nM
Citation
 PubChem, PC Formylpeptide Receptor (FPRL1) Ligand Structure Activity Relationship (SAR) Analysis : FPR Dose Response Counterscreen Assay PubChem Bioassay (2007)[AID] 
Target
Name:
fMet-Leu-Phe receptor
Synonyms:
FPR FPR1_HUMAN N-formyl peptide receptor 1 fMLP receptor formyl peptide receptor 1
Type:
Enzyme Catalytic Domain
Mol. Mass.:
38456.14
Organism:
Homo sapiens (Human)
Description:
gi_4503779
Residue:
350
  
Inhibitor
Name:
BDBM40751
Synonyms:
2-cyclohexyl-N-(5-imidazo[1,2-a]pyrimidin-2-yl-2-methoxy-phenyl)acetamide 2-cyclohexyl-N-(5-imidazo[1,2-a]pyrimidin-2-yl-2-methoxyphenyl)acetamide UNM000003658201 | cid_7080254
Type:
Small organic molecule
Emp. Form.:
C21H24N4O2
Mol. Mass.:
364.4409
SMILES:
COc1ccc(cc1NC(=O)CC1CCCCC1)-c1cn2cccnc2n1
: