Target
Sphingosine 1-phosphate receptor 3
Ligand
BDBM31079
Substrate
Meas. Tech.
S1P3 Dose Response Assay Counterscreen for 5-Hydroxytryptamine(Serotonin) Receptor Subtype 1E Antagonists
IC50
>39000±n/a nM
Citation
 PubChem, PC S1P3 Dose Response Assay Counterscreen for 5-Hydroxytryptamine(Serotonin) Receptor Subtype 1E Antagonists PubChem Bioassay (2007)[AID] 
Target
Name:
Sphingosine 1-phosphate receptor 3
Synonyms:
C9orf108 EDG3 S1P receptor 3 S1P3 S1PR3_HUMAN Sphingosine 1-phosphate receptor 3 (S1P3) | Sphingosine 1-phosphate receptor Edg-3
Type:
G Protein-Coupled Receptor (GPCR)
Mol. Mass.:
42278.13
Organism:
Homo sapiens (Human)
Description:
Q99500
Residue:
378
  
Inhibitor
Name:
BDBM31079
Synonyms:
2-propoxyethyl 6-(2,5-dimethoxyphenyl)-3-methyl-4-oxidanylidene-1,5,6,7-tetrahydroindole-2-carboxylate 6-(2,5-dimethoxyphenyl)-3-methyl-4-oxo-1,5,6,7-tetrahydroindole-2-carboxylic acid 2-propoxyethyl ester MLS000116025 cid_5214133
Type:
Small organic molecule
Emp. Form.:
C23H29NO6
Mol. Mass.:
415.4795
SMILES:
CCCOCCOC(=O)c1[nH]c2CC(CC(=O)c2c1C)c1cc(OC)ccc1OC
: