Target
Heat shock 70 kDa protein 1A
Ligand
BDBM31710
Substrate
Meas. Tech.
TR-FRET secondary assay for HTS discovery of chemical inhibitors of Hsp70
IC50
>100000±0 nM
Citation
 PubChem, PC TR-FRET secondary assay for HTS discovery of chemical inhibitors of Hsp70 PubChem Bioassay (2008)[AID] 
Target
Name:
Heat shock 70 kDa protein 1A
Synonyms:
HSPA1A V9GZ37_HUMAN | heat shock 70kDa protein 1A
Type:
ATP-binding protein
Mol. Mass.:
51937.99
Organism:
Homo sapiens (Human)
Description:
gi_123271505; GST-tagged ATPase domain
Residue:
476
  
Inhibitor
Name:
BDBM31710
Synonyms:
1-(4-chlorophenyl)-3-(1,5-dimethyl-3-oxidanylidene-2-phenyl-pyrazol-4-yl)urea 1-(4-chlorophenyl)-3-(1,5-dimethyl-3-oxo-2-phenylpyrazol-4-yl)urea CHEMBL210298 SMR000111484 | cid_1367800
Type:
Small organic molecule
Emp. Form.:
C18H17ClN4O2
Mol. Mass.:
356.806
SMILES:
Cc1c(NC(=O)Nc2ccc(Cl)cc2)c(=O)n(-c2ccccc2)n1C
: