Target
Complement C1s subcomponent
Ligand
BDBM40806
Substrate
Meas. Tech.
Complement factor C1s IC50 from mixture screen
IC50
>50000±0 nM
Citation
 PubChem, PC Complement factor C1s IC50 from mixture screen PubChem Bioassay (2008)[AID] 
Target
Name:
Complement C1s subcomponent
Synonyms:
C1 esterase C1S_HUMAN Complement C1s subcomponent Complement C1s subcomponent light chain Trypsin | complement component 1, s subcomponent
Type:
Protein
Mol. Mass.:
76657.91
Organism:
Homo sapiens (Human)
Description:
P09871
Residue:
688
  
Inhibitor
Name:
BDBM40806
Synonyms:
(10Z)-8,8-dimethyl-10-(methylaminomethylene)pyrano[2,3-f]chromene-2,9-quinone (10Z)-8,8-dimethyl-10-(methylaminomethylidene)pyrano[2,3-f]chromene-2,9-dione MLS000035772 cid_3115287
Type:
Small organic molecule
Emp. Form.:
C16H15NO4
Mol. Mass.:
285.2946
SMILES:
CNC=C1C(=O)C(C)(C)Oc2ccc3ccc(=O)oc3c12
: